{"text_format":"3","workbook":"xlsx","n_sheets":5,"sheets":["チェック","相性評価","過去のチェック結果一覧","使い方・注意事項","ツール用"],"not_rendered":{"macros":1,"defined_names":1},"read":"whole","date_system":"1900"}

{"sheet":"チェック","index":0,"n_rows":69,"n_cols":11,"rows_kept":69,"merged":[[2,3,2,8],[2,10,2,11]]}
[{"$nulls":3},{"$f":"ISERROR(MATCH(D5,相性評価!$B$3:$B$75,0))","v":true},{"$f":"ISERROR(MATCH(E5,相性評価!$B$3:$B$75,0))","v":true},{"$f":"ISERROR(MATCH(F5,相性評価!$B$3:$B$75,0))","v":true},{"$f":"ISERROR(MATCH(G5,相性評価!$B$3:$B$75,0))","v":true},{"$f":"ISERROR(MATCH(H5,相性評価!$B$3:$B$75,0))","v":true},{"$f":"ISERROR(MATCH(I5,相性評価!$B$3:$B$75,0))","v":true}]
[{"$nulls":3},{"$f":"MATCH(D5,相性評価!$B$3:$B$75,0)","v":{"$error":"#N/A"}},{"$f":"MATCH(E5,相性評価!$B$3:$B$75,0)","v":{"$error":"#N/A"}},{"$f":"MATCH(F5,相性評価!$B$3:$B$75,0)","v":{"$error":"#N/A"}},{"$f":"MATCH(G5,相性評価!$B$3:$B$75,0)","v":{"$error":"#N/A"}},{"$f":"MATCH(H5,相性評価!$B$3:$B$75,0)","v":{"$error":"#N/A"}},{"$f":"MATCH(I5,相性評価!$B$3:$B$75,0)","v":{"$error":"#N/A"}}]
[{"$nulls":3},"PT",{"$nulls":6},"キツイポケモン"]
[{"$nulls":3},1,2,3,4,5,6,null,1]
[{"$nulls":10},2]
[{"$nulls":3},"予測変換用","予測変換用","予測変換用","予測変換用","予測変換用","予測変換用",null,3]
[{"$nulls":3},"ガブリアス","ガブリアス","ガブリアス","ガブリアス","ガブリアス","ガブリアス",null,4]
[{"$nulls":3},"ゲンガー","ゲンガー","ゲンガー","ゲンガー","ゲンガー","ゲンガー",null,5]
[{"$nulls":3},"霊獣ランドロス","霊獣ランドロス","霊獣ランドロス","霊獣ランドロス","霊獣ランドロス","霊獣ランドロス",null,6]
[{"$nulls":3},"クレセリア","クレセリア","クレセリア","クレセリア","クレセリア","クレセリア",null,7]
[{"$nulls":3},"ファイアロー","ファイアロー","ファイアロー","ファイアロー","ファイアロー","ファイアロー",null,8]
[{"$nulls":3},"スイクン","スイクン","スイクン","スイクン","スイクン","スイクン",null,9]
[{"$nulls":3},"ガルーラ","ガルーラ","ガルーラ","ガルーラ","ガルーラ","ガルーラ",null,10]
[{"$nulls":3},"化身ボルトロス","化身ボルトロス","化身ボルトロス","化身ボルトロス","化身ボルトロス","化身ボルトロス"]
[{"$nulls":3},"バンギラス","バンギラス","バンギラス","バンギラス","バンギラス","バンギラス"]
[{"$nulls":3},"キノガッサ","キノガッサ","キノガッサ","キノガッサ","キノガッサ","キノガッサ"]
[{"$nulls":3},"ギャラドス","ギャラドス","ギャラドス","ギャラドス","ギャラドス","ギャラドス"]
[{"$nulls":3},"マリルリ","マリルリ","マリルリ","マリルリ","マリルリ","マリルリ"]
[{"$nulls":3},"ギルガルド","ギルガルド","ギルガルド","ギルガルド","ギルガルド","ギルガルド"]
[{"$nulls":3},"バシャーモ","バシャーモ","バシャーモ","バシャーモ","バシャーモ","バシャーモ"]
[{"$nulls":3},"ヒードラン","ヒードラン","ヒードラン","ヒードラン","ヒードラン","ヒードラン"]
[{"$nulls":3},"リザードン","リザードン","リザードン","リザードン","リザードン","リザードン"]
[{"$nulls":3},"ハッサム","ハッサム","ハッサム","ハッサム","ハッサム","ハッサム"]
[{"$nulls":3},"ライコウ","ライコウ","ライコウ","ライコウ","ライコウ","ライコウ"]
[{"$nulls":3},"ナットレイ","ナットレイ","ナットレイ","ナットレイ","ナットレイ","ナットレイ"]
[{"$nulls":3},"クチート","クチート","クチート","クチート","クチート","クチート"]
[{"$nulls":3},"サンダー","サンダー","サンダー","サンダー","サンダー","サンダー"]
[{"$nulls":3},"ポリゴン２","ポリゴン２","ポリゴン２","ポリゴン２","ポリゴン２","ポリゴン２"]
[{"$nulls":3},"ルカリオ","ルカリオ","ルカリオ","ルカリオ","ルカリオ","ルカリオ"]
[{"$nulls":3},"霊獣ボルトロス","霊獣ボルトロス","霊獣ボルトロス","霊獣ボルトロス","霊獣ボルトロス","霊獣ボルトロス"]
[{"$nulls":3},"ニンフィア","ニンフィア","ニンフィア","ニンフィア","ニンフィア","ニンフィア"]
[{"$nulls":3},"サーナイト","サーナイト","サーナイト","サーナイト","サーナイト","サーナイト"]
[{"$nulls":3},"ピクシー","ピクシー","ピクシー","ピクシー","ピクシー","ピクシー"]
[{"$nulls":3},"グライオン","グライオン","グライオン","グライオン","グライオン","グライオン"]
[{"$nulls":3},"クレッフィ","クレッフィ","クレッフィ","クレッフィ","クレッフィ","クレッフィ"]
[{"$nulls":3},"パルシェン","パルシェン","パルシェン","パルシェン","パルシェン","パルシェン"]
[{"$nulls":3},"サザンドラ","サザンドラ","サザンドラ","サザンドラ","サザンドラ","サザンドラ"]
[{"$nulls":3},"ローブシン","ローブシン","ローブシン","ローブシン","ローブシン","ローブシン"]
[{"$nulls":3},"フシギバナ","フシギバナ","フシギバナ","フシギバナ","フシギバナ","フシギバナ"]
[{"$nulls":3},"カバルドン","カバルドン","カバルドン","カバルドン","カバルドン","カバルドン"]
[{"$nulls":3},"ロトム水","ロトム水","ロトム水","ロトム水","ロトム水","ロトム水"]
[{"$nulls":3},"カイリュー","カイリュー","カイリュー","カイリュー","カイリュー","カイリュー"]
[{"$nulls":3},"ラティオス","ラティオス","ラティオス","ラティオス","ラティオス","ラティオス"]
[{"$nulls":3},"エンテイ","エンテイ","エンテイ","エンテイ","エンテイ","エンテイ"]
[{"$nulls":3},"ライボルト","ライボルト","ライボルト","ライボルト","ライボルト","ライボルト"]
[{"$nulls":3},"キリキザン","キリキザン","キリキザン","キリキザン","キリキザン","キリキザン"]
[{"$nulls":3},"ニョロトノ","ニョロトノ","ニョロトノ","ニョロトノ","ニョロトノ","ニョロトノ"]
[{"$nulls":3},"ドリュウズ","ドリュウズ","ドリュウズ","ドリュウズ","ドリュウズ","ドリュウズ"]
[{"$nulls":3},"エルフーン","エルフーン","エルフーン","エルフーン","エルフーン","エルフーン"]
[{"$nulls":3},"ユキノオー","ユキノオー","ユキノオー","ユキノオー","ユキノオー","ユキノオー"]
[{"$nulls":3},"ヘラクロス","ヘラクロス","ヘラクロス","ヘラクロス","ヘラクロス","ヘラクロス"]
[{"$nulls":3},"ジバコイル","ジバコイル","ジバコイル","ジバコイル","ジバコイル","ジバコイル"]
[{"$nulls":3},"化身ランドロス","化身ランドロス","化身ランドロス","化身ランドロス","化身ランドロス","化身ランドロス"]
[{"$nulls":3},"ヤドラン","ヤドラン","ヤドラン","ヤドラン","ヤドラン","ヤドラン"]
[{"$nulls":3},"ピクシー","ピクシー","ピクシー","ピクシー","ピクシー","ピクシー"]
[{"$nulls":3},"メタモン","メタモン","メタモン","メタモン","メタモン","メタモン"]
[{"$nulls":3},"ソーナンス","ソーナンス","ソーナンス","ソーナンス","ソーナンス","ソーナンス"]
[{"$nulls":3},"ハピナス","ハピナス","ハピナス","ハピナス","ハピナス","ハピナス"]
[{"$nulls":3},"ラティアス","ラティアス","ラティアス","ラティアス","ラティアス","ラティアス"]
[{"$nulls":3},"マンムー","マンムー","マンムー","マンムー","マンムー","マンムー"]
[{"$nulls":3},"シャンデラ","シャンデラ","シャンデラ","シャンデラ","シャンデラ","シャンデラ"]
[{"$nulls":3},"オーロッド","オーロッド","オーロッド","オーロッド","オーロッド","オーロッド"]
[{"$nulls":3},"オムスター","オムスター","オムスター","オムスター","オムスター","オムスター"]
[{"$nulls":3},"ジュペッタ","ジュペッタ","ジュペッタ","ジュペッタ","ジュペッタ","ジュペッタ"]
[{"$nulls":3},"ラグラージ","ラグラージ","ラグラージ","ラグラージ","ラグラージ","ラグラージ"]
[{"$nulls":3},"メタグロス","メタグロス","メタグロス","メタグロス","メタグロス","メタグロス"]
[{"$nulls":3},"ロトム火","ロトム火","ロトム火","ロトム火","ロトム火","ロトム火"]
[{"$nulls":3},"アグノム","アグノム","アグノム","アグノム","アグノム","アグノム"]
[{"$nulls":3},"ゲッコウガ","ゲッコウガ","ゲッコウガ","ゲッコウガ","ゲッコウガ","ゲッコウガ"]

{"sheet":"相性評価","index":1,"n_rows":66,"n_cols":66,"rows_kept":66,"merged":[[0,65,0,74],[65,0,74,0]]}
[{"$nulls":65},"追加可能エリア"]
[null,null,"ガブリアス","ゲンガー","霊獣ランドロス","クレセリア","ファイアロー","スイクン","ガルーラ","化身ボルトロス","バンギラス","キノガッサ","ギャラドス","マリルリ","ギルガルド","バシャーモ","ヒードラン","リザードン","ハッサム","ライコウ","ナットレイ","クチート","サンダー","ポリゴン２","ルカリオ","霊獣ボルトロス","ニンフィア","サーナイト","ピクシー","グライオン","クレッフィ","パルシェン","サザンドラ","ローブシン","フシギバナ","カバルドン","ロトム水","カイリュー","ラティオス","エンテイ","ライボルト","キリキザン","ニョロトノ","ドリュウズ","エルフーン","ユキノオー","ヘラクロス","ジバコイル","化身ランドロス","ヤドラン","ラッキー","メタモン","ソーナンス","ハピナス","ラティアス","マンムー","シャンデラ","オーロッド","オムスター","ジュペッタ","ラグラージ","メタグロス","ロトム火","アグノム","ゲッコウガ"]
[null,"ガブリアス",5,7,3,2,7,2,5,3,7,7,3,2,8,9,9,9,4,6,4,5,6,2,8,5,3,3,2,2,7,1,7,4,7,3,7,5,5,9,6,7,6,9,2,3,5,8,8,2,8,5,3,7,5,3,9,4,7,4,4,8,7,5,3]
[null,"ゲンガー",3,5,2,8,2,5,8,4,2,7,5,4,4,4,3,7,5,3,2,4,7,4,4,7,8,7,8,9,5,7,3,3,8,6,7,5,7,4,4,3,5,4,8,4,5,5,7,9,4,5,8,4,8,7,8,7,5,7,5,8,7,5,3]
[null,"霊獣ランドロス",7,8,5,3,7,2,7,5,8,7,3,3,8,9,8,7,4,6,3,5,4,2,7,5,5,4,3,2,7,2,5,5,5,3,2,4,5,8,5,5,3,8,2,2,6,8,7,3,6,5,5,5,4,3,9,5,3,4,4,7,6,6,4]
[null,"クレセリア",9,2,7,5,6,3,8,7,1,5,4,4,1,8,1,5,2,2,1,4,4,3,7,6,3,2,2,7,2,8,3,9,6,6,6,7,4,8,7,2,6,4,4,6,2,3,8,6,2,6,2,2,5,8,2,4,5,3,6,7,6,7,2]
[null,"ファイアロー",3,8,3,4,5,2,7,3,3,8,3,3,5,9,2,6,8,3,7,6,2,2,7,3,7,7,4,2,3,4,6,8,8,3,2,5,5,6,2,6,3,5,9,9,9,3,6,2,5,5,5,4,4,6,5,9,2,6,3,7,2,6,6]
[null,"スイクン",8,5,8,7,8,5,4,2,7,2,5,5,8,8,8,6,6,2,3,5,2,6,5,2,3,3,7,9,8,7,3,3,3,8,3,7,3,8,2,6,5,7,3,2,3,3,7,7,8,6,5,8,5,8,7,7,7,6,7,6,5,5,2]
[null,"ガルーラ",5,2,3,2,3,6,5,4,8,5,4,6,6,2,8,7,3,7,3,4,5,4,2,4,7,7,5,6,6,6,7,2,7,2,7,6,6,6,7,6,6,6,7,7,3,9,6,3,7,5,4,7,5,9,8,3,6,3,5,6,7,6,7]
[null,"化身ボルトロス",7,6,5,3,7,8,6,5,4,6,9,8,6,8,5,7,6,2,5,4,5,3,7,5,3,3,7,8,8,8,6,4,3,3,5,4,4,6,2,7,8,4,7,4,4,3,8,9,2,5,4,2,3,3,6,7,9,6,3,5,2,3,3]
[null,"バンギラス",3,8,2,9,7,3,2,6,5,1,4,2,3,1,7,7,2,8,3,2,8,7,1,4,2,2,3,2,3,7,6,1,4,2,4,6,8,6,8,4,3,2,2,6,1,5,3,8,7,5,6,7,8,3,8,7,4,7,3,2,7,9,3]
[null,"キノガッサ",3,3,3,5,2,8,5,4,9,5,6,8,5,3,3,4,4,7,2,7,5,8,7,6,7,5,8,2,4,6,7,7,1,8,8,4,3,2,6,9,9,6,1,3,5,3,5,8,8,5,9,8,3,2,3,2,8,4,9,8,5,6,7]
[null,"ギャラドス",7,5,7,6,7,5,6,1,6,4,5,4,6,8,8,7,5,2,2,3,2,2,7,2,4,4,5,7,4,2,4,5,3,6,3,7,4,7,2,3,4,7,3,3,3,2,7,3,5,5,6,4,4,8,8,6,6,4,5,5,6,6,6]
[null,"マリルリ",8,6,7,6,7,5,4,2,8,2,6,5,4,8,7,6,4,2,2,3,2,3,6,2,6,6,5,7,5,3,9,8,2,7,3,7,7,7,2,5,6,7,3,2,3,2,7,3,6,5,4,5,7,7,7,3,6,4,6,6,5,7,7]
[null,"ギルガルド",2,6,2,9,5,2,4,4,7,5,4,6,5,3,2,2,4,4,5,5,4,3,7,5,8,8,6,2,3,8,2,3,7,3,6,5,8,2,6,3,5,3,6,8,7,6,2,8,6,6,5,6,8,4,2,5,6,6,3,8,3,8,2]
[null,"バシャーモ",1,6,1,2,1,2,8,2,9,7,2,2,7,5,7,6,9,7,9,8,5,8,7,7,4,4,3,3,7,8,7,3,4,2,3,3,4,5,6,8,4,7,7,8,8,7,4,2,8,5,3,9,3,3,4,8,7,6,3,8,7,5,7]
[null,"ヒードラン",1,7,2,9,8,2,2,5,3,7,2,3,8,3,5,7,9,7,9,9,7,8,1,6,8,8,7,2,8,7,3,2,7,2,3,2,7,3,7,8,2,2,8,8,7,7,1,6,5,6,6,6,8,2,5,7,2,7,2,7,7,8,2]
[null,"リザードン",1,3,3,5,4,4,3,3,3,6,3,4,8,4,3,5,9,3,9,8,7,4,7,3,7,7,7,6,8,7,3,7,7,6,4,3,2,3,3,7,4,6,8,8,8,6,6,5,3,5,4,3,2,4,4,8,3,7,6,8,7,7,4]
[null,"ハッサム",6,5,6,8,2,4,7,4,8,6,5,6,6,1,1,1,5,5,7,3,2,7,4,4,8,8,8,7,5,5,3,6,7,5,3,5,8,1,2,5,5,4,7,8,6,4,5,8,8,5,8,3,8,8,2,6,4,4,5,8,2,3,6]
[null,"ライコウ",4,7,4,8,7,8,3,8,2,3,8,8,6,3,3,7,5,5,2,4,8,6,6,7,3,3,4,7,5,8,4,3,3,2,5,5,4,5,3,6,8,2,2,2,4,3,7,8,3,6,6,6,3,1,5,4,8,7,2,6,2,5,4]
[null,"ナットレイ",6,8,7,9,3,7,7,5,7,8,8,8,5,1,1,1,3,8,5,2,2,8,2,3,8,6,7,3,4,7,3,2,7,6,8,7,8,1,2,3,8,5,8,7,2,5,7,4,8,6,7,3,9,8,1,4,8,4,7,6,1,3,7]
[null,"クチート",5,6,5,6,4,5,6,6,8,3,7,7,5,2,1,2,7,6,8,5,4,7,6,7,8,8,8,2,5,7,5,8,7,3,6,8,8,2,3,6,5,3,8,7,8,5,2,6,8,5,4,6,8,4,2,7,4,5,3,7,2,7,6]
[null,"サンダー",4,3,6,6,8,8,5,5,2,5,8,8,6,5,3,3,8,2,8,6,5,5,7,4,2,2,4,4,6,7,2,6,4,3,5,6,2,4,3,7,7,5,6,5,6,5,7,8,2,6,6,2,2,3,5,6,6,6,3,6,3,5,3]
[null,"ポリゴン２",8,6,8,7,8,4,6,7,3,2,8,7,7,2,2,6,3,4,2,3,5,5,2,7,4,3,3,8,5,8,7,2,3,6,7,8,6,5,8,4,7,4,3,7,2,7,8,7,3,5,6,2,8,8,5,6,7,7,7,7,7,7,8]
[null,"ルカリオ",2,6,3,3,3,5,8,3,9,3,3,4,3,3,9,3,6,4,8,4,3,8,5,3,7,7,8,3,6,8,7,2,7,2,6,3,5,3,3,9,6,5,8,7,4,6,4,2,8,5,6,7,7,3,2,7,7,6,3,5,3,3,3]
[null,"霊獣ボルトロス",5,3,5,4,7,8,6,5,6,4,8,8,5,3,4,7,6,3,7,3,6,3,7,5,3,3,5,7,4,7,3,4,3,4,6,4,2,6,3,6,8,3,5,3,5,2,8,9,3,4,6,2,2,2,6,4,7,6,3,5,2,4,3]
[null,"ニンフィア",7,2,5,7,3,7,3,7,8,3,6,4,2,6,2,3,2,7,2,2,8,6,3,7,5,5,6,7,3,7,8,9,3,6,8,6,8,2,7,3,7,2,7,7,7,3,5,7,2,5,3,2,8,6,2,7,7,7,7,2,2,7,8]
[null,"サーナイト",7,3,6,8,3,7,3,7,8,5,6,4,2,6,2,3,2,7,4,2,8,7,3,7,5,5,7,8,3,7,8,9,6,7,8,7,8,3,7,7,7,3,7,7,8,5,5,7,6,5,3,6,8,6,3,8,7,7,7,3,5,7,8]
[null,"ピクシー",8,2,7,8,6,3,5,3,7,2,5,5,4,7,3,3,2,6,3,2,6,7,2,5,4,3,5,3,7,7,8,8,3,4,5,7,7,3,6,2,4,2,2,5,6,3,2,7,7,7,4,7,8,7,4,3,4,5,3,2,4,6,7]
[null,"グライオン",8,1,8,3,8,1,4,2,8,8,3,3,8,7,8,4,3,3,7,8,6,2,7,3,3,2,7,5,7,2,3,3,6,7,3,3,3,7,4,7,2,7,3,3,8,4,6,3,7,7,7,7,3,2,2,3,2,3,7,8,6,3,2]
[null,"クレッフィ",3,5,3,8,7,2,4,2,7,6,6,5,7,3,2,2,5,5,6,5,4,5,4,6,7,7,3,3,5,7,5,3,8,3,6,5,7,2,4,3,4,3,3,6,3,6,2,7,2,7,7,2,8,3,3,5,6,7,3,8,3,5,6]
[null,"パルシェン",9,3,8,2,6,3,4,2,3,4,8,7,2,2,3,3,5,2,3,3,3,2,2,3,3,3,3,8,3,5,4,2,4,7,2,8,3,5,2,4,4,6,7,5,3,3,5,2,8,4,6,5,3,8,2,8,3,4,6,5,3,3,2]
[null,"サザンドラ",3,7,5,7,4,7,3,4,4,3,6,1,8,3,7,7,7,6,7,5,8,3,3,7,2,2,2,7,5,6,5,2,7,7,8,5,3,7,6,7,7,6,3,4,4,5,7,8,2,4,8,2,2,2,9,8,7,8,7,7,8,7,3]
[null,"ローブシン",6,7,5,1,2,7,8,6,9,3,5,2,7,7,8,3,4,7,8,2,4,8,8,6,1,1,2,7,7,8,8,5,3,3,7,5,4,6,6,9,6,8,4,8,4,8,6,2,9,5,3,9,3,9,5,6,8,6,5,2,7,3,5]
[null,"フシギバナ",3,2,5,4,2,7,3,7,6,9,7,8,3,6,3,3,3,7,3,3,6,7,3,7,7,4,7,4,2,6,3,7,5,7,8,3,2,2,7,3,8,3,8,8,3,6,3,8,6,6,7,6,2,7,3,4,7,5,8,2,5,2,4]
[null,"カバルドン",7,4,7,4,7,2,8,7,8,2,4,3,7,8,8,4,5,8,4,7,7,4,8,6,4,3,6,3,7,3,3,7,3,5,2,7,3,7,7,7,2,8,3,2,2,6,4,2,4,5,7,3,2,4,7,3,2,4,4,8,7,3,1]
[null,"ロトム水",3,3,8,4,8,7,3,5,6,2,7,7,4,7,7,6,7,5,2,4,5,3,4,4,2,2,5,7,4,8,2,3,2,8,5,3,2,7,5,6,7,7,2,2,3,5,8,8,2,5,6,2,2,9,7,2,8,5,7,6,8,6,7]
[null,"カイリュー",5,5,6,3,5,3,4,6,4,6,3,3,5,7,8,7,5,5,3,2,4,2,7,6,4,3,3,7,5,2,5,5,7,3,7,5,6,6,6,6,7,6,3,2,3,6,7,3,7,4,4,7,6,2,7,4,7,4,4,6,8,7,5]
[null,"ラティオス",5,3,5,6,5,7,4,6,2,7,6,3,2,6,3,8,2,6,2,2,8,4,5,8,2,2,3,7,3,7,7,6,8,7,8,4,5,7,7,2,7,6,2,3,7,3,7,7,4,5,3,4,5,3,5,6,7,7,7,2,8,5,2]
[null,"エンテイ",1,6,2,2,4,2,4,4,4,8,3,3,8,5,7,7,9,5,9,8,6,5,7,4,8,7,7,3,8,5,3,4,8,3,3,4,3,5,7,7,2,2,7,8,8,8,2,2,7,5,5,7,2,3,3,8,1,7,3,8,3,6,2]
[null,"ライボルト",4,6,5,3,8,8,3,8,2,4,8,8,4,4,3,7,8,7,8,7,7,2,7,7,3,3,4,6,6,8,4,4,3,3,5,4,3,3,5,6,8,3,5,7,5,7,8,8,2,4,6,2,3,2,5,6,7,6,2,6,2,6,3]
[null,"キリキザン",3,7,5,8,4,4,4,3,6,1,7,5,7,2,2,3,5,4,7,4,3,6,1,4,7,3,8,3,7,6,3,1,7,3,4,4,8,3,4,5,4,2,7,7,2,4,2,7,7,5,6,5,8,2,5,8,4,6,3,8,3,7,4]
[null,"ニョロトノ",4,5,7,4,7,5,4,2,7,1,6,4,5,6,8,6,5,2,2,5,3,3,4,2,3,3,6,8,6,6,3,4,2,8,3,3,3,8,2,6,5,7,4,2,3,2,7,4,2,5,5,2,3,7,8,3,7,6,6,6,6,6,3]
[null,"ドリュウズ",1,6,2,6,5,3,4,6,8,4,3,3,7,3,8,4,6,8,5,7,5,6,5,7,8,7,8,3,7,4,4,2,7,2,3,4,4,8,7,8,3,5,7,7,4,8,2,3,7,5,7,6,4,2,8,4,5,4,3,7,2,5,2]
[null,"エルフーン",8,2,8,6,1,7,3,3,8,9,7,7,4,3,2,2,3,8,2,2,4,7,2,5,3,3,8,7,7,3,7,6,2,7,8,7,8,3,5,3,6,3,5,2,4,2,4,7,7,7,6,7,7,2,2,5,5,7,6,6,2,6,4]
[null,"ユキノオー",7,6,8,4,1,8,3,6,4,7,7,8,2,2,2,2,2,8,3,3,5,3,3,7,3,3,5,7,4,5,6,2,2,8,8,8,7,2,3,3,8,3,8,5,2,2,8,8,2,5,4,2,7,7,2,8,8,7,8,2,2,3,5]
[null,"ヘラクロス",5,5,4,8,1,7,7,6,9,5,7,7,3,2,3,2,4,6,8,2,4,8,6,5,3,2,4,2,7,7,6,6,7,8,7,7,3,2,5,8,7,6,6,8,5,6,3,8,9,5,8,9,5,7,2,2,7,4,8,2,2,3,3]
[null,"ジバコイル",2,5,2,7,7,7,1,7,5,7,8,8,4,3,3,4,6,7,5,5,5,3,4,8,7,5,7,6,4,7,5,2,4,4,5,4,7,2,3,6,8,2,8,8,4,5,2,8,2,5,6,2,6,2,2,5,8,6,2,4,2,3,2]
[null,"化身ランドロス",2,3,3,2,4,3,4,2,7,5,3,3,8,6,9,4,5,3,3,8,3,2,6,2,5,5,8,4,8,5,3,4,7,6,2,3,3,8,2,8,3,8,6,2,7,8,5,2,2,5,3,2,3,1,9,3,3,5,3,7,3,4,2]
[null,"ヤドラン",8,1,7,4,8,3,7,1,2,2,7,7,2,8,4,5,2,2,6,4,2,3,8,1,3,3,3,7,3,8,2,8,2,8,2,7,3,8,2,3,6,7,3,2,2,2,8,5,2,6,5,2,4,8,3,3,7,5,7,8,3,6,3]
[null,"ピクシー",2,6,4,8,5,2,3,8,3,2,5,4,4,2,5,7,2,7,2,2,8,7,2,7,8,4,3,3,8,2,8,1,4,6,8,3,6,3,8,3,8,3,3,8,1,8,8,8,5,5,7,7,8,8,5,3,5,6,3,2,5,6,8]
[null,"メタモン",5,5,5,4,5,4,5,5,5,5,5,5,4,5,4,5,5,4,4,5,4,5,5,6,5,5,3,3,3,6,6,5,4,5,5,6,5,5,6,5,5,5,3,5,5,5,5,4,5,5,4,4,5,5,5,4,6,5,4,5,5,5,5]
[null,"ソーナンス",7,2,5,8,5,5,6,6,4,1,4,6,5,7,4,6,2,4,3,6,4,4,4,4,7,7,6,3,3,4,2,7,3,3,4,6,7,5,4,4,5,3,4,6,2,4,7,5,3,6,5,3,5,8,3,3,6,4,3,8,4,6,2]
[null,"ハピナス",3,6,5,8,6,2,3,8,3,2,6,5,4,1,4,7,7,4,7,4,8,8,3,8,8,4,3,3,8,5,8,1,4,7,8,3,6,3,8,5,8,4,3,8,1,8,8,8,3,6,7,5,6,5,3,4,8,5,4,5,7,8,8]
[null,"ラティアス",5,2,6,5,6,5,5,7,2,7,6,3,2,7,2,8,2,7,1,2,8,2,3,8,2,2,2,7,2,7,8,7,8,8,8,4,5,8,7,2,7,6,3,3,5,4,7,6,2,5,5,4,5,3,4,3,7,5,5,2,8,7,2]
[null,"マンムー",7,3,7,2,4,2,1,7,7,8,2,3,6,7,8,6,2,9,2,6,7,2,7,8,4,4,3,8,7,2,8,1,3,6,1,8,7,7,8,8,3,8,8,3,3,8,9,2,2,5,2,5,7,5,8,6,7,4,5,5,3,5,4]
[null,"シャンデラ",1,2,1,8,5,3,2,4,2,7,2,3,8,6,5,6,8,5,9,8,5,5,8,4,8,7,6,8,7,8,1,5,7,3,3,3,5,7,5,5,2,2,8,8,8,8,1,7,5,5,7,7,6,2,5,8,2,6,2,8,6,8,2]
[null,"オーロッド",6,3,5,6,1,3,7,3,3,8,4,7,5,2,3,2,4,6,6,3,4,4,3,6,3,2,7,7,5,2,2,4,6,7,8,6,4,2,4,2,7,6,5,2,8,5,7,7,7,6,7,6,7,4,2,5,4,3,6,7,5,4,2]
[null,"オムスター",3,5,7,5,8,3,4,1,6,2,4,4,4,3,8,7,6,2,2,6,4,3,3,3,3,3,6,8,4,7,3,2,3,8,2,3,3,9,3,6,3,5,5,2,3,2,7,3,5,4,4,2,3,3,8,6,5,7,6,7,6,7,3]
[null,"ジュペッタ",6,3,6,7,4,4,7,4,3,6,6,6,4,4,3,3,6,3,6,5,4,3,4,4,3,3,5,7,3,6,2,4,5,6,5,6,3,3,4,4,4,6,3,3,6,4,5,5,4,5,6,5,5,6,4,7,3,5,6,7,5,7,2]
[null,"ラグラージ",6,5,6,4,7,3,5,7,7,1,5,4,7,7,8,4,5,8,3,7,7,3,7,7,3,3,7,3,7,4,3,5,2,6,3,6,3,7,8,7,4,7,4,2,2,8,7,3,7,6,7,6,5,5,8,4,4,4,5,7,3,6,2]
[null,"メタグロス",2,2,3,3,3,4,4,5,8,2,5,4,2,2,3,2,2,4,4,3,4,3,5,5,8,7,8,2,2,5,3,8,8,2,4,4,8,2,4,2,4,3,4,8,8,6,3,2,8,5,2,5,8,5,2,3,3,3,3,5,2,6,2]
[null,"ロトム火",3,3,4,4,8,5,3,8,3,5,4,5,7,3,3,3,8,8,9,8,7,3,7,8,8,5,6,4,7,7,2,3,5,3,2,2,2,7,8,7,4,8,8,8,8,8,7,7,5,5,6,3,2,7,4,5,4,5,7,8,5,5,2]
[null,"アグノム",5,5,4,3,4,5,4,7,1,4,4,3,2,5,2,3,7,5,7,3,5,3,7,6,3,3,4,7,5,7,3,7,8,7,4,3,5,4,4,3,4,5,4,7,7,7,6,4,4,5,4,2,3,5,2,6,3,3,4,4,5,5,2]
[null,"ゲッコウガ",7,7,6,8,4,8,3,7,7,3,4,3,8,3,8,6,4,6,3,4,7,2,7,7,2,2,3,8,4,8,7,5,6,9,3,5,8,8,7,6,7,8,6,5,7,8,8,7,2,5,8,2,8,6,8,8,7,8,8,8,8,8,5]
["追加可能エリア"]

{"sheet":"過去のチェック結果一覧","index":2,"n_rows":103,"n_cols":20,"rows_kept":103,"merged":[[1,1,2,1],[1,2,1,7],[1,8,1,17],[1,18,2,18]]}
[]
[null,"PTNO","PT",{"$nulls":5},"キツイポケモン",{"$nulls":9},"チェックした日時"]
[null,null,1,2,3,4,5,6,1,2,3,4,5,6,7,8,9,10]
[null,1]
[null,2]
[null,3]
[null,4]
[null,5]
[null,6]
[null,7]
[null,8]
[null,9]
[null,10]
[null,11]
[null,12]
[null,13]
[null,14]
[null,15]
[null,16]
[null,17]
[null,18]
[null,19]
[null,20]
[null,21]
[null,22]
[null,23]
[null,24]
[null,25]
[null,26]
[null,27]
[null,28]
[null,29]
[null,30]
[null,31]
[null,32]
[null,33]
[null,34]
[null,35]
[null,36]
[null,37]
[null,38]
[null,39]
[null,40]
[null,41]
[null,42]
[null,43]
[null,44]
[null,45]
[null,46]
[null,47]
[null,48]
[null,49]
[null,50]
[null,51]
[null,52]
[null,53]
[null,54]
[null,55]
[null,56]
[null,57]
[null,58]
[null,59]
[null,60]
[null,61]
[null,62]
[null,63]
[null,64]
[null,65]
[null,66]
[null,67]
[null,68]
[null,69]
[null,70]
[null,71]
[null,72]
[null,73]
[null,74]
[null,75]
[null,76]
[null,77]
[null,78]
[null,79]
[null,80]
[null,81]
[null,82]
[null,83]
[null,84]
[null,85]
[null,86]
[null,87]
[null,88]
[null,89]
[null,90]
[null,91]
[null,92]
[null,93]
[null,94]
[null,95]
[null,96]
[null,97]
[null,98]
[null,99]
[null,100,{"$nulls":17},{"$f":"NOW()","v":"2014-10-07T19:26:34.500"}]

{"sheet":"使い方・注意事項","index":3,"n_rows":0,"n_cols":0,"rows_kept":0}

{"sheet":"ツール用","index":4,"n_rows":76,"n_cols":75,"rows_kept":76,"merged":[[0,65,0,74]]}
[{"$nulls":65},"追加可能エリア"]
[null,null,"ガブリアス","ゲンガー","霊獣ランドロス","クレセリア","ファイアロー","スイクン","ガルーラ","化身ボルトロス","バンギラス","キノガッサ","ギャラドス","マリルリ","ギルガルド","バシャーモ","ヒードラン","リザードン","ハッサム","ライコウ","ナットレイ","クチート","サンダー","ポリゴン２","ルカリオ","霊獣ボルトロス","ニンフィア","サーナイト","ピクシー","グライオン","クレッフィ","パルシェン","サザンドラ","ローブシン","フシギバナ","カバルドン","ロトム水","カイリュー","ラティオス","エンテイ","ライボルト","キリキザン","ニョロトノ","ドリュウズ","エルフーン","ユキノオー","ヘラクロス","ジバコイル","化身ランドロス","ヤドラン","ラッキー","メタモン","ソーナンス","ハピナス","ラティアス","マンムー","シャンデラ","オーロッド","オムスター","ジュペッタ","ラグラージ","メタグロス","ロトム火","アグノム","ゲッコウガ",{"$f":"相性評価!BN2","v":0},{"$f":"相性評価!BO2","v":0},{"$f":"相性評価!BP2","v":0},{"$f":"相性評価!BQ2","v":0},{"$f":"相性評価!BR2","v":0},{"$f":"相性評価!BS2","v":0},{"$f":"相性評価!BT2","v":0},{"$f":"相性評価!BU2","v":0},{"$f":"相性評価!BV2","v":0},{"$f":"相性評価!BW2","v":0}]
[null,"バシャーモ",1,6,1,2,1,2,8,2,9,7,2,2,7,5,7,6,9,7,9,8,5,8,7,7,4,4,3,3,7,8,7,3,4,2,3,3,4,5,6,8,4,7,7,8,8,7,4,2,8,5,3,9,3,3,4,8,7,6,3,8,7,5,7]
[null,"ナットレイ",6,8,7,9,3,7,7,5,7,8,8,8,5,1,1,1,3,8,5,2,2,8,2,3,8,6,7,3,4,7,3,2,7,6,8,7,8,1,2,3,8,5,8,7,2,5,7,4,8,6,7,3,9,8,1,4,8,4,7,6,1,3,7]
[null,"サンダー",4,3,6,6,8,8,5,5,2,5,8,8,6,5,3,3,8,2,8,6,5,5,7,4,2,2,4,4,6,7,2,6,4,3,5,6,2,4,3,7,7,5,6,5,6,5,7,8,2,6,6,2,2,3,5,6,6,6,3,6,3,5,3]
[null,"マリルリ",8,6,7,6,7,5,4,2,8,2,6,5,4,8,7,6,4,2,2,3,2,3,6,2,6,6,5,7,5,3,9,8,2,7,3,7,7,7,2,5,6,7,3,2,3,2,7,3,6,5,4,5,7,7,7,3,6,4,6,6,5,7,7]
[null,"クレセリア",9,2,7,5,6,3,8,7,1,5,4,4,1,8,1,5,2,2,1,4,4,3,7,6,3,2,2,7,2,8,3,9,6,6,6,7,4,8,7,2,6,4,4,6,2,3,8,6,2,6,2,2,5,8,2,4,5,3,6,7,6,7,2]
[null,"ガブリアス",5,7,3,2,7,2,5,3,7,7,3,2,8,9,9,9,4,6,4,5,6,2,8,5,3,3,2,2,7,1,7,4,7,3,7,5,5,9,6,7,6,9,2,3,5,8,8,2,8,5,3,7,5,3,9,4,7,4,4,8,7,5,3]
[null,"合計",{"$f":"SUM(C3:C8)","v":33},{"$f":"SUM(D3:D8)","v":32},{"$f":"SUM(E3:E8)","v":31},30,32,27,37,24,34,34,31,29,31,36,28,30,30,27,29,28,24,29,37,27,26,23,23,26,31,34,31,32,30,27,32,35,30,34,26,32,37,37,30,31,26,30,41,25,34,33,25,28,31,32,28,29,39,27,29,41,29,32,29,{"$f":"SUM(BN3:BN8)","v":0},{"$f":"SUM(BO3:BO8)","v":0},{"$f":"SUM(BP3:BP8)","v":0},{"$f":"SUM(BQ3:BQ8)","v":0},{"$f":"SUM(BR3:BR8)","v":0},{"$f":"SUM(BS3:BS8)","v":0},{"$f":"SUM(BT3:BT8)","v":0},{"$f":"SUM(BU3:BU8)","v":0},{"$f":"SUM(BV3:BV8)","v":0},{"$f":"SUM(BW3:BW8)","v":0}]
[]
[]
[]
[null,"評価用"]
[null,"サーナイト",23]
[null,"ピクシー",23]
[null,"化身ボルトロス",24]
[null,"サンダー",24]
[null,"ヤドラン",25]
[null,"ソーナンス",25]
[null,"ニンフィア",26]
[null,"グライオン",26]
[null,"ライボルト",26]
[null,"ヘラクロス",26]
[null,"スイクン",27]
[null,"ライコウ",27]
[null,"霊獣ボルトロス",27]
[null,"カバルドン",27]
[null,"ジュペッタ",27]
[null,"ヒードラン",28]
[null,"クチート",28]
[null,"ハピナス",28]
[null,"シャンデラ",28]
[null,"マリルリ",29]
[null,"ナットレイ",29]
[null,"ポリゴン２",29]
[null,"オーロッド",29]
[null,"ラグラージ",29]
[null,"ロトム火",29]
[null,"ゲッコウガ",29]
[null,"クレセリア",30]
[null,"リザードン",30]
[null,"ハッサム",30]
[null,"フシギバナ",30]
[null,"ラティオス",30]
[null,"エルフーン",30]
[null,"ジバコイル",30]
[null,"霊獣ランドロス",31]
[null,"ギャラドス",31]
[null,"ギルガルド",31]
[null,"クレッフィ",31]
[null,"サザンドラ",31]
[null,"ユキノオー",31]
[null,"ラティアス",31]
[null,"ゲンガー",32]
[null,"ファイアロー",32]
[null,"ローブシン",32]
[null,"ロトム水",32]
[null,"キリキザン",32]
[null,"マンムー",32]
[null,"アグノム",32]
[null,"ガブリアス",33]
[null,"メタモン",33]
[null,"バンギラス",34]
[null,"キノガッサ",34]
[null,"パルシェン",34]
[null,"エンテイ",34]
[null,"ラッキー",34]
[null,"カイリュー",35]
[null,"バシャーモ",36]
[null,"ガルーラ",37]
[null,"ルカリオ",37]
[null,"ニョロトノ",37]
[null,"ドリュウズ",37]
[null,"オムスター",39]
[null,"化身ランドロス",41]
[null,"メタグロス",41]